Target
Tyrosine-protein kinase JAK1
Ligand
BDBM50309910
Substrate
Meas. Tech.
ChEMBL_774338 (CHEMBL1908555)
Kd
>10000±n/a nM
Citation
 Davis, MIHunt, JPHerrgard, SCiceri, PWodicka, LMPallares, GHocker, MTreiber, DKZarrinkar, PP Comprehensive analysis of kinase inhibitor selectivity. Nat Biotechnol 29:1046-51 (2011)  
Target
Name:
Tyrosine-protein kinase JAK1
Synonyms:
JAK-1 JAK1A JAK1_HUMAN Janus kinase 1 (JAK1) | Janus kinase 1 JAK1
Type:
Protein
Mol. Mass.:
133293.73
Organism:
Homo sapiens (Human)
Description:
P23458
Residue:
1154
  
Inhibitor
Name:
BDBM50309910
Synonyms:
CHEMBL608154 N-(6-chloro-7-methoxy-9H-pyrido[3,4-b]indol-8-yl)-2-methylnicotinamide
Type:
Small organic molecule
Emp. Form.:
C19H15ClN4O2
Mol. Mass.:
366.801
SMILES:
COc1c(Cl)cc2c3ccncc3[nH]c2c1NC(=O)c1cccnc1C
: