Target
Receptor-type tyrosine-protein kinase FLT3
Ligand
BDBM32362
Substrate
Meas. Tech.
ChEMBL_774420 (CHEMBL1908637)
Kd
>10000±n/a nM
Citation
 Davis, MIHunt, JPHerrgard, SCiceri, PWodicka, LMPallares, GHocker, MTreiber, DKZarrinkar, PP Comprehensive analysis of kinase inhibitor selectivity. Nat Biotechnol 29:1046-51 (2011)  
Target
Name:
Receptor-type tyrosine-protein kinase FLT3
Synonyms:
CD135 FL cytokine receptor FLK2 FLT3 Fetal liver kinase-2 Fms-like tyrosine kinase 3 (Flt-3) STK-1 Stem cell tyrosine kinase 1
Type:
Enzyme
Mol. Mass.:
112888.62
Organism:
Homo sapiens (Human)
Description:
P36888
Residue:
993
  
Inhibitor
Name:
BDBM32362
Synonyms:
5-[[3-methoxy-4-[(4-methoxyphenyl)methoxy]phenyl]methyl]pyrimidine-2,4-diamine [2-amino-5-(3-methoxy-4-p-anisyloxy-benzyl)pyrimidin-4-yl]amine | cid_11617559
Type:
Small organic molecule
Emp. Form.:
C20H22N4O3
Mol. Mass.:
366.4137
SMILES:
COc1ccc(COc2ccc(Cc3cnc(N)nc3N)cc2OC)cc1
: