Target
Mitogen-activated protein kinase 3
Ligand
BDBM25028
Substrate
Meas. Tech.
ChEMBL_774365 (CHEMBL1908582)
Kd
>10000±n/a nM
Citation
 Davis, MIHunt, JPHerrgard, SCiceri, PWodicka, LMPallares, GHocker, MTreiber, DKZarrinkar, PP Comprehensive analysis of kinase inhibitor selectivity. Nat Biotechnol 29:1046-51 (2011)  
Target
Name:
Mitogen-activated protein kinase 3
Synonyms:
ERK1 Extracellular signal-regulated kinase 1 MAP kinase ERK1 MAPK3/MAPK7 Mitogen-activated protein kinase PRKM3
Type:
Protein
Mol. Mass.:
43136.58
Organism:
Homo sapiens (Human)
Description:
curated by PDB 4QTB
Residue:
379
  
Inhibitor
Name:
BDBM25028
Synonyms:
4-[2-(1H-indazol-4-yl)-6-[(4-methanesulfonylpiperazin-1-yl)methyl]thieno[3,2-d]pyrimidin-4-yl]morpholine GDC0941 US10851091, Compound pictilisib
Type:
Small organic molecule
Emp. Form.:
C23H27N7O3S2
Mol. Mass.:
513.636
SMILES:
CS(=O)(=O)N1CCN(Cc2cc3nc(nc(N4CCOCC4)c3s2)-c2cccc3[nH]ncc23)CC1
: