Target
Hormonally up-regulated neu tumor-associated kinase
Ligand
BDBM4552
Substrate
Meas. Tech.
ChEMBL_774564 (CHEMBL1908781)
Kd
5000±n/a nM
Citation
 Davis, MIHunt, JPHerrgard, SCiceri, PWodicka, LMPallares, GHocker, MTreiber, DKZarrinkar, PP Comprehensive analysis of kinase inhibitor selectivity. Nat Biotechnol 29:1046-51 (2011)  
Target
Name:
Hormonally up-regulated neu tumor-associated kinase
Synonyms:
B19 HUNK_HUMAN Serine/threonine-protein kinase MAK-V
Type:
PROTEIN
Mol. Mass.:
79715.88
Organism:
Homo sapiens (Human)
Description:
ChEMBL_774564
Residue:
714
  
Inhibitor
Name:
BDBM4552
Synonyms:
4-[(2,4-Dichloro-5-methoxyphenyl)amino]-6-methoxy-7-[3-(4-methyl-1-piperazinyl)propoxy]-3-quinolinecarbonitrile BOSUTINIB SKI-606
Type:
Small organic molecule
Emp. Form.:
C26H29Cl2N5O3
Mol. Mass.:
530.446
SMILES:
COc1cc(Nc2c(cnc3cc(OCCCN4CCN(C)CC4)c(OC)cc23)C#N)c(Cl)cc1Cl
: