Target
Muscarinic acetylcholine receptor M3
Ligand
BDBM50355615
Substrate
Meas. Tech.
ChEMBL_776521 (CHEMBL1913618)
Ki
1.9±n/a nM
Citation
 Glossop, PAWatson, CAPrice, DABunnage, MEMiddleton, DSWood, AJames, KRoberts, DStrang, RSYeadon, MPerros-Huguet, CClarke, NPTrevethick, MAMachin, IStuart, EFEvans, SMHarrison, ACFairman, DAAgoram, BBurrows, JLFeeder, NFulton, CKDillon, BREntwistle, DASpence, FJ Inhalation by design: novel tertiary amine muscarinic M3 receptor antagonists with slow off-rate binding kinetics for inhaled once-daily treatment of chronic obstructive pulmonary disease. J Med Chem 54:6888-904 (2011)  
Target
Name:
Muscarinic acetylcholine receptor M3
Synonyms:
ACM3_HUMAN Cholinergic, muscarinic M3 Muscarinic receptor M3 | RecName: Full=Muscarinic acetylcholine receptor M3
Type:
Enzyme
Mol. Mass.:
66151.03
Organism:
Homo sapiens (Human)
Description:
P20309
Residue:
590
  
Inhibitor
Name:
BDBM50355615
Synonyms:
CHEMBL1910845
Type:
Small organic molecule
Emp. Form.:
C27H30N2O2
Mol. Mass.:
414.5393
SMILES:
NC(=O)C(CCCN1CC[C@@H](C1)Oc1ccccc1)(c1ccccc1)c1ccccc1
: