Target
Indoleamine 2,3-dioxygenase 1
Ligand
BDBM21973
Substrate
Meas. Tech.
ChEMBL_775230 (CHEMBL1912584)
Ki
34000±n/a nM
Citation
 Huang, QZheng, MYang, SKuang, CYu, CYang, Q Structure-activity relationship and enzyme kinetic studies on 4-aryl-1H-1,2,3-triazoles as indoleamine 2,3-dioxygenase (IDO) inhibitors. Eur J Med Chem 46:5680-7 (2011)  
Target
Name:
Indoleamine 2,3-dioxygenase 1
Synonyms:
I23O1_HUMAN IDO-1 INDO Indoleamine 2,3-dioxygenase | Indoleamine-pyrrole 2,3-dioxygenase
Type:
Enzyme
Mol. Mass.:
45330.80
Organism:
Homo sapiens (Human)
Description:
P14902
Residue:
403
  
Inhibitor
Name:
BDBM21973
Synonyms:
1-Methyltryptophan, 1 | 2-amino-3-(1-methyl-1H-indol-3-yl)propanoic acid
Type:
Small organic molecule
Emp. Form.:
C12H14N2O2
Mol. Mass.:
218.2518
SMILES:
Cn1cc(CC(N)C(O)=O)c2ccccc12
: