Target
Alpha-galactosidase
Ligand
BDBM50356096
Substrate
Meas. Tech.
ChEMBL_775921 (CHEMBL1912894)
Ki
3400±n/a nM
Citation
 Fröhlich, RFFantur, KFurneaux, RHPaschke, EStütz, AEWicki, JWithers, SGWrodnigg, TM A fluorescent probe for GM1 gangliosidosis relatedß-galactosidase: N-(dansylamino)hexylaminocarbonylpentyl-1,5-dideoxy-1,5-imino-D-galactitol. Bioorg Med Chem Lett 21:6872-5 (2011)  
Target
Name:
Alpha-galactosidase
Synonyms:
α-galactosidase Alpha-galactosidase
Type:
Protein
Mol. Mass.:
41306.82
Organism:
Coffea arabica (Coffee beans)
Description:
Residue:
378
  
Inhibitor
Name:
BDBM50356096
Synonyms:
CHEMBL1911831
Type:
Small organic molecule
Emp. Form.:
C30H48N4O7S
Mol. Mass.:
608.79
SMILES:
CN(C)c1cccc2c(cccc12)S(=O)(=O)NCCCCCCNC(=O)CCCCCN1C[C@H](O)[C@@H](O)[C@@H](O)[C@H]1CO
: