Target
Urokinase-type plasminogen activator
Ligand
BDBM50356118
Substrate
Meas. Tech.
ChEMBL_775994 (CHEMBL1912992)
IC50
>1000000±n/a nM
Citation
 Matthews, HRanson, MTyndall, JDKelso, MJ Synthesis and preliminary evaluation of amiloride analogs as inhibitors of the urokinase-type plasminogen activator (uPA). Bioorg Med Chem Lett 21:6760-6 (2011)  
Target
Name:
Urokinase-type plasminogen activator
Synonyms:
PLAU UROK_HUMAN Urokinase-type plasminogen activator (uPA) | Urokinase-type plasminogen activator/surface receptor
Type:
Enzyme
Mol. Mass.:
48528.62
Organism:
Homo sapiens (Human)
Description:
P00749
Residue:
431
  
Inhibitor
Name:
BDBM50356118
Synonyms:
CHEMBL1909778
Type:
Small organic molecule
Emp. Form.:
C6H7ClN6O
Mol. Mass.:
214.612
SMILES:
NC(=N)NC(=O)c1nc(Cl)cnc1N
: