Target
Urokinase-type plasminogen activator
Ligand
BDBM50356141
Substrate
Meas. Tech.
ChEMBL_775994 (CHEMBL1912992)
IC50
14000±n/a nM
Citation
 Matthews, HRanson, MTyndall, JDKelso, MJ Synthesis and preliminary evaluation of amiloride analogs as inhibitors of the urokinase-type plasminogen activator (uPA). Bioorg Med Chem Lett 21:6760-6 (2011)  
Target
Name:
Urokinase-type plasminogen activator
Synonyms:
PLAU UROK_HUMAN Urokinase-type plasminogen activator (uPA) | Urokinase-type plasminogen activator/surface receptor
Type:
Enzyme
Mol. Mass.:
48528.62
Organism:
Homo sapiens (Human)
Description:
P00749
Residue:
431
  
Inhibitor
Name:
BDBM50356141
Synonyms:
CHEMBL1909801
Type:
Small organic molecule
Emp. Form.:
C12H21ClN8O
Mol. Mass.:
328.801
SMILES:
CCN(CC)CCNc1nc(N)c(nc1Cl)C(=O)NC(N)=N
: