Target
Sphingosine 1-phosphate receptor 4
Ligand
BDBM50356254
Substrate
Meas. Tech.
ChEMBL_774916 (CHEMBL1913361)
EC50
3100±n/a nM
Citation
 Urbano, MGuerrero, MVelaparthi, SCrisp, MChase, PHodder, PSchaeffer, MTBrown, SRosen, HRoberts, E Discovery, synthesis and SAR analysis of novel selective small molecule S1P4-R agonists based on a (2Z,5Z)-5-((pyrrol-3-yl)methylene)-3-alkyl-2-(alkylimino)thiazolidin-4-one chemotype. Bioorg Med Chem Lett 21:6739-45 (2011)  
Target
Name:
Sphingosine 1-phosphate receptor 4
Synonyms:
EDG6 S1P receptor 4 S1P4 S1PR4_HUMAN Sphingosine 1-phosphate receptor Edg-6 sphingosine-1-phosphate 4 S1P4
Type:
G Protein-Coupled Receptor (GPCR)
Mol. Mass.:
41647.39
Organism:
Homo sapiens (Human)
Description:
Residue:
384
  
Inhibitor
Name:
BDBM50356254
Synonyms:
CHEMBL1910685
Type:
Small organic molecule
Emp. Form.:
C17H17FN4OS
Mol. Mass.:
344.406
SMILES:
C\N=C1/S\C(=C/c2cc(C)n(c2C)-c2ncccc2F)C(=O)N1C
: