Target
Calcitonin gene-related peptide 1
Ligand
BDBM23402
Substrate
Meas. Tech.
ChEMBL_775006 (CHEMBL1912161)
Ki
7300±n/a nM
Citation
 Zartman, CBBell, IMGallicchio, SNGraham, SLKane, SAMallee, JJRutledge, RZSalvatore, CAVacca, JPWilliams, TM Identification of a novel RAMP-independent CGRP receptor antagonist. Bioorg Med Chem Lett 21:6705-8 (2011)  
Target
Name:
Calcitonin gene-related peptide 1
Synonyms:
CALC1 CALCA_HUMAN Calcitonin gene-related peptide (CGRP alpha) | Calcitonin gene-related peptide 1
Type:
Enzyme
Mol. Mass.:
13902.80
Organism:
Homo sapiens (Human)
Description:
P06881
Residue:
128
  
Inhibitor
Name:
BDBM23402
Synonyms:
5-(1,1-dioxo-1,2-thiazinan-2-yl)-N-[(4-fluorophenyl)methyl]-8-hydroxy-1,6-naphthyridine-7-carboxamide L-870,810
Type:
Small organic molecule
Emp. Form.:
C20H19FN4O4S
Mol. Mass.:
430.453
SMILES:
Oc1c(nc(N2CCCCS2(=O)=O)c2cccnc12)C(=O)NCc1ccc(F)cc1
: