Target
Neuronal acetylcholine receptor subunit alpha-7
Ligand
BDBM50356473
Substrate
Meas. Tech.
ChEMBL_775797 (CHEMBL1912300)
Ki
290±n/a nM
Citation
 Kombo, DCMazurov, ATallapragada, KHammond, PSChewning, JHauser, TAVasquez-Valdivieso, MYohannes, DTalley, TTTaylor, PCaldwell, WS Docking studies of benzylidene anabaseine interactions witha7 nicotinic acetylcholine receptor (nAChR) and acetylcholine binding proteins (AChBPs): application to the design of relateda7 selective ligands. Eur J Med Chem 46:5625-35 (2011)  
Target
Name:
Neuronal acetylcholine receptor subunit alpha-7
Synonyms:
ACHA7_RAT Cholinergic, Nicotinic Alpha7 Chrna7 Neuronal acetylcholine receptor (alpha7 nAChR) Neuronal acetylcholine receptor subunit alpha-7 Neuronal acetylcholine receptor subunit alpha-7 (nAChR)
Type:
Enzyme
Mol. Mass.:
56502.44
Organism:
Rattus norvegicus (Rat)
Description:
Q05941
Residue:
502
  
Inhibitor
Name:
BDBM50356473
Synonyms:
CHEMBL1911864
Type:
Small organic molecule
Emp. Form.:
C15H19N3O
Mol. Mass.:
257.3309
SMILES:
Oc1ccccc1C1=NCC2(CN3CCC2CC3)N1
: