Target
Neuronal acetylcholine receptor subunit alpha-7
Ligand
BDBM50356472
Substrate
Meas. Tech.
ChEMBL_775805 (CHEMBL1912308)
EC50
1200±n/a nM
Citation
 Kombo, DCMazurov, ATallapragada, KHammond, PSChewning, JHauser, TAVasquez-Valdivieso, MYohannes, DTalley, TTTaylor, PCaldwell, WS Docking studies of benzylidene anabaseine interactions witha7 nicotinic acetylcholine receptor (nAChR) and acetylcholine binding proteins (AChBPs): application to the design of relateda7 selective ligands. Eur J Med Chem 46:5625-35 (2011)  
Target
Name:
Neuronal acetylcholine receptor subunit alpha-7
Synonyms:
ACHA7_RAT Cholinergic, Nicotinic Alpha7 Chrna7 Neuronal acetylcholine receptor (alpha7 nAChR) Neuronal acetylcholine receptor subunit alpha-7 Neuronal acetylcholine receptor subunit alpha-7 (nAChR)
Type:
Enzyme
Mol. Mass.:
56502.44
Organism:
Rattus norvegicus (Rat)
Description:
Q05941
Residue:
502
  
Inhibitor
Name:
BDBM50356472
Synonyms:
CHEMBL1911862
Type:
Small organic molecule
Emp. Form.:
C17H20N4O
Mol. Mass.:
296.3669
SMILES:
Nc1c(oc2ccccc12)C1=NC2(CN1)CN1CCC2CC1
: