Target
Acetylcholine-binding protein
Ligand
BDBM50264117
Substrate
Meas. Tech.
ChEMBL_775753 (CHEMBL1912187)
Kd
0.4±n/a nM
Citation
 Kombo, DCMazurov, ATallapragada, KHammond, PSChewning, JHauser, TAVasquez-Valdivieso, MYohannes, DTalley, TTTaylor, PCaldwell, WS Docking studies of benzylidene anabaseine interactions witha7 nicotinic acetylcholine receptor (nAChR) and acetylcholine binding proteins (AChBPs): application to the design of relateda7 selective ligands. Eur J Med Chem 46:5625-35 (2011)  
Target
Name:
Acetylcholine-binding protein
Synonyms:
ACHP_LYMST Acetylcholine Binding protein Acetylcholine-binding protein (Ls-AchBP) | AchBP
Type:
Mol. Mass.:
26055.52
Organism:
Lymnaea stagnalis
Description:
Soluble acetylcholine receptor
Residue:
229
  
Inhibitor
Name:
BDBM50264117
Synonyms:
3-[1-(4-Hydroxy-2-methoxy-phenyl)-meth-(E)-ylidene]-3,4,5,6-tetrahydro-[2,3']bipyridinyl-1-ium
Type:
Small organic molecule
Emp. Form.:
C18H19N2O2
Mol. Mass.:
295.3551
SMILES:
COc1cc(O)ccc1\C=C1/CCC[NH+]=C1c1cccnc1
: