Target
Nitric oxide synthase, brain
Ligand
BDBM50356483
Substrate
Meas. Tech.
ChEMBL_775890 (CHEMBL1912863)
EC50
2100±n/a nM
Citation
 Gahman, TCHerbert, MRLang, HThayer, ASymons, KTNguyen, PMMassari, MEDozier, SZhang, YSablad, MRao, TSNoble, SAShiau, AKHassig, CA Identification and SAR of selective inducible nitric oxide synthase (iNOS) dimerization inhibitors. Bioorg Med Chem Lett 21:6888-94 (2011)  
Target
Name:
Nitric oxide synthase, brain
Synonyms:
Constitutive NOS NC-NOS NOS type I nNOS NOS1_HUMAN Neuronal nitric oxide synthase Nitric oxide synthase, neuronal (nNOS) bNOS | nNOS
Type:
Homodimer
Mol. Mass.:
160985.98
Organism:
Homo sapiens (Human)
Description:
P29475
Residue:
1434
  
Inhibitor
Name:
BDBM50356483
Synonyms:
CHEMBL1912001
Type:
Small organic molecule
Emp. Form.:
C21H22N6O3S
Mol. Mass.:
438.503
SMILES:
C(CNCc1ccc2OCOc2c1)CN(Cc1ccco1)c1nc(ns1)-n1ccnc1
: