Target
Cytochrome P450 3A4
Ligand
BDBM50356577
Substrate
Meas. Tech.
ChEMBL_776115 (CHEMBL1912811)
IC50
22000±n/a nM
Citation
 Wang, WDevasthale, PWang, AHarrity, TEgan, DMorgan, NCap, MFura, AKlei, HEKish, KWeigelt, CSun, LLevesque, PLi, YXZahler, RKirby, MSHamann, LG 7-Oxopyrrolopyridine-derived DPP4 inhibitors-mitigation of CYP and hERG liabilities via introduction of polar functionalities in the active site. Bioorg Med Chem Lett 21:6646-51 (2011)  
Target
Name:
Cytochrome P450 3A4
Synonyms:
Albendazole monooxygenase CP3A4_HUMAN CYP3A4 CYPIIIA4 Cytochrome P450 3A4 (CYP3A4) Nifedipine oxidase Taurochenodeoxycholate 6-alpha-hydroxylase
Type:
Enzyme
Mol. Mass.:
57349.57
Organism:
Homo sapiens (Human)
Description:
Residue:
503
  
Inhibitor
Name:
BDBM50356577
Synonyms:
CHEMBL1910114
Type:
Small organic molecule
Emp. Form.:
C18H19Cl2N3O2
Mol. Mass.:
380.268
SMILES:
COCCN1Cc2c(nc(C)c(CN)c2-c2ccc(Cl)cc2Cl)C1=O
: