Target
Dipeptidyl peptidase 9
Ligand
BDBM50356583
Substrate
Meas. Tech.
ChEMBL_776113 (CHEMBL1912809)
Ki
262±n/a nM
Citation
 Wang, WDevasthale, PWang, AHarrity, TEgan, DMorgan, NCap, MFura, AKlei, HEKish, KWeigelt, CSun, LLevesque, PLi, YXZahler, RKirby, MSHamann, LG 7-Oxopyrrolopyridine-derived DPP4 inhibitors-mitigation of CYP and hERG liabilities via introduction of polar functionalities in the active site. Bioorg Med Chem Lett 21:6646-51 (2011)  
Target
Name:
Dipeptidyl peptidase 9
Synonyms:
DPP9 DPRP-2 Dipeptidyl peptidase 9 (DDP9) Dipeptidyl peptidase 9 (DPP9) Dipeptidyl peptidase IX Dipeptidyl peptidase-like protein 9
Type:
Enzyme
Mol. Mass.:
98260.70
Organism:
Homo sapiens (Human)
Description:
Q86TI2
Residue:
863
  
Inhibitor
Name:
BDBM50356583
Synonyms:
CHEMBL1910125
Type:
Small organic molecule
Emp. Form.:
C21H20Cl2N6O2
Mol. Mass.:
459.329
SMILES:
Cc1nc2C(=O)N(CC(=O)Nc3ccnn3C)Cc2c(c1CN)-c1ccc(Cl)cc1Cl
: