Target
Dipeptidyl peptidase 8
Ligand
BDBM50356580
Substrate
Meas. Tech.
ChEMBL_776112 (CHEMBL1912808)
Ki
3990±n/a nM
Citation
 Wang, WDevasthale, PWang, AHarrity, TEgan, DMorgan, NCap, MFura, AKlei, HEKish, KWeigelt, CSun, LLevesque, PLi, YXZahler, RKirby, MSHamann, LG 7-Oxopyrrolopyridine-derived DPP4 inhibitors-mitigation of CYP and hERG liabilities via introduction of polar functionalities in the active site. Bioorg Med Chem Lett 21:6646-51 (2011)  
Target
Name:
Dipeptidyl peptidase 8
Synonyms:
DPP8 DPRP-1 Dipeptidyl peptidase 8 (DPP-8) Dipeptidyl peptidase 8/9 Dipeptidyl peptidase VIII Prolyl dipeptidase DPP8
Type:
Enzyme
Mol. Mass.:
103342.62
Organism:
Homo sapiens (Human)
Description:
Q6V1X1
Residue:
898
  
Inhibitor
Name:
BDBM50356580
Synonyms:
CHEMBL1910111
Type:
Small organic molecule
Emp. Form.:
C18H17Cl2N3O3
Mol. Mass.:
394.252
SMILES:
COC(=O)CN1Cc2c(nc(C)c(CN)c2-c2ccc(Cl)cc2Cl)C1=O
: