Target
Muscarinic acetylcholine receptor M5
Ligand
BDBM50356971
Substrate
Meas. Tech.
ChEMBL_788050 (CHEMBL1919029)
EC50
>10000±n/a nM
Citation
 Lebois, EPDigby, GJSheffler, DJMelancon, BJTarr, JCCho, HPMiller, NRMorrison, RBridges, TMXiang, ZScott Daniels, JWood, MRConn, PJLindsley, CW Development of a highly selective, orally bioavailable and CNS penetrant M1 agonist derived from the MLPCN probe ML071. Bioorg Med Chem Lett 21:6451-5 (2011)  
Target
Name:
Muscarinic acetylcholine receptor M5
Synonyms:
ACM5_RAT Chrm-5 Muscarinic acetylcholine receptor | Muscarinic acetylcholine receptor M5
Type:
Enzyme Catalytic Domain
Mol. Mass.:
60161.80
Organism:
RAT
Description:
Cholinergic, muscarinic M5 CHRM5 RAT::P08911
Residue:
531
  
Inhibitor
Name:
BDBM50356971
Synonyms:
CHEMBL1916228
Type:
Small organic molecule
Emp. Form.:
C21H31N3O4
Mol. Mass.:
389.4885
SMILES:
CCOC(=O)N1CCC(CC1)N1CCC[C@H](C1)NC(=O)c1cccc(OC)c1
: