Target
Histamine H3 receptor
Ligand
BDBM50350021
Substrate
Meas. Tech.
ChEMBL_787545 (CHEMBL1919506)
Ki
2±n/a nM
Citation
 Dandu, RRGruner, JAMathiasen, JRAimone, LDHostetler, GBenfield, CBendesky, RJMarcy, VRRaddatz, RHudkins, RL Synthesis and evaluation of pyridazinone-phenethylamine derivatives as selective and orally bioavailable histamine H3 receptor antagonists with robust wake-promoting activity. Bioorg Med Chem Lett 21:6362-5 (2011)  
Target
Name:
Histamine H3 receptor
Synonyms:
G-protein coupled receptor 97 HH3R HRH3 Histamine H3 receptor (H3) Histamine receptor (H3 and H4)
Type:
G Protein-Coupled Receptor (GPCR)
Mol. Mass.:
48691.47
Organism:
Homo sapiens (Human)
Description:
Binding assays were using CHO cells stably expressing hH3R receptors.
Residue:
445
  
Inhibitor
Name:
BDBM50350021
Synonyms:
CHEMBL1813067
Type:
Small organic molecule
Emp. Form.:
C18H23N3O2
Mol. Mass.:
313.3941
SMILES:
C[C@@H]1CCCN1CCCOc1ccc(cc1)-c1ccc(=O)[nH]n1
: