Target
cAMP and cAMP-inhibited cGMP 3',5'-cyclic phosphodiesterase 10A
Ligand
BDBM50419441
Substrate
Meas. Tech.
ChEMBL_785491 (CHEMBL1919970)
IC50
100±n/a nM
Citation
 Andrés, JIDe Angelis, MAlcázar, JIturrino, LLanglois, XDedeurwaerdere, SLenaerts, IVanhoof, GCelen, SBormans, G Synthesis, in vivo occupancy, and radiolabeling of potent phosphodiesterase subtype-10 inhibitors as candidates for positron emission tomography imaging. J Med Chem 54:5820-35 (2011)  
Target
Name:
cAMP and cAMP-inhibited cGMP 3',5'-cyclic phosphodiesterase 10A
Synonyms:
PDE10_RAT Phosphodiesterase 10 Phosphodiesterase Type 10 (PDE10A) | Rat recombinant PDE10a (rPDE10a)
Type:
Enzyme
Mol. Mass.:
90160.88
Organism:
Rattus norvegicus (rat)
Description:
PDE10A was generated from the full-length recombinant rat clone transfected into Sf9 cells.
Residue:
794
  
Inhibitor
Name:
BDBM50419441
Synonyms:
CHEMBL1915740
Type:
Small organic molecule
Emp. Form.:
C23H18F4N4O
Mol. Mass.:
442.4088
SMILES:
FCCn1cc(c(n1)-c1ccc(OCc2ccc(cn2)C(F)(F)F)cc1)-c1ccncc1
: