Target
Beta-secretase 1
Ligand
BDBM50357730
Substrate
Meas. Tech.
ChEMBL_785501 (CHEMBL1920064)
IC50
20±n/a nM
Citation
 Boy, KMGuernon, JMShi, JToyn, JHMeredith, JEBarten, DMBurton, CRAlbright, CFMarcinkeviciene, JGood, ACTebben, AJMuckelbauer, JKCamac, DMLentz, KABronson, JJOlson, REMacor, JEThompson, LA Monosubstituted¿-lactam and conformationally constrained 1,3-diaminopropan-2-ol transition-state isostere inhibitors ofß-secretase (BACE). Bioorg Med Chem Lett 21:6916-24 (2011)  
Target
Name:
Beta-secretase 1
Synonyms:
ASP2 Aspartyl protease 2 BACE1 Beta-secretase (BACE) Beta-secretase 1 (BACE 1) Beta-secretase 1 (BACE1) Beta-site amyloid precursor protein cleaving enzyme 1 Memapsin-2 beta-Secretase (BACE-1) | beta-Secretase (BACE1)
Type:
Protein
Mol. Mass.:
55755.10
Organism:
Homo sapiens (Human)
Description:
P56817
Residue:
501
  
Inhibitor
Name:
BDBM50357730
Synonyms:
CHEMBL1915989
Type:
Small organic molecule
Emp. Form.:
C39H48F2N4O5
Mol. Mass.:
690.819
SMILES:
CCC(C)[C@]1(CCN([C@@H](CCc2ccccc2)C(=O)N[C@@H](Cc2cc(F)cc(F)c2)[C@H](O)[C@H]2Cc3cccc(OC)c3CN2)C1=O)NC(C)=O
: