Target
Beta-secretase 1
Ligand
BDBM50357731
Substrate
Meas. Tech.
ChEMBL_785500 (CHEMBL1920063)
IC50
1.4±n/a nM
Citation
 Boy, KMGuernon, JMShi, JToyn, JHMeredith, JEBarten, DMBurton, CRAlbright, CFMarcinkeviciene, JGood, ACTebben, AJMuckelbauer, JKCamac, DMLentz, KABronson, JJOlson, REMacor, JEThompson, LA Monosubstituted¿-lactam and conformationally constrained 1,3-diaminopropan-2-ol transition-state isostere inhibitors ofß-secretase (BACE). Bioorg Med Chem Lett 21:6916-24 (2011)  
Target
Name:
Beta-secretase 1
Synonyms:
ASP2 Aspartyl protease 2 BACE1 Beta-secretase (BACE) Beta-secretase 1 (BACE 1) Beta-secretase 1 (BACE1) Beta-site amyloid precursor protein cleaving enzyme 1 Memapsin-2 beta-Secretase (BACE-1) | beta-Secretase (BACE1)
Type:
Protein
Mol. Mass.:
55755.10
Organism:
Homo sapiens (Human)
Description:
P56817
Residue:
501
  
Inhibitor
Name:
BDBM50357731
Synonyms:
CHEMBL1915990
Type:
Small organic molecule
Emp. Form.:
C36H50F2N4O5
Mol. Mass.:
656.8028
SMILES:
CCCO[C@H]1CN[C@H](C1)[C@@H](O)[C@H](Cc1cc(F)cc(F)c1)NC(=O)[C@H](CCc1ccccc1)N1CC[C@@](CC(C)C)(NC(C)=O)C1=O
: