Target
MAP kinase-activated protein kinase 5
Ligand
BDBM50357884
Substrate
Meas. Tech.
ChEMBL_786782 (CHEMBL1919623)
IC50
>10000±n/a nM
Citation
 Lumeras, WVidal, LVidal, BBalagué, COrellana, AMaldonado, MDomínguez, MSegarra, VCaturla, F 1,7-Naphthyridine 1-oxides as novel potent and selective inhibitors of p38 mitogen activated protein kinase. J Med Chem 54:7899-910 (2011)  
Target
Name:
MAP kinase-activated protein kinase 5
Synonyms:
MAP kinase-activated protein kinase 5 (PRAK) MAPK-activated protein kinase 5 MAPKAP kinase 5 PRAK p38-regulated/activated protein kinase (PRAK)
Type:
Serine/threonine-protein kinase
Mol. Mass.:
54229.92
Organism:
Homo sapiens (Human)
Description:
Recombinant MAPKAPK5 was phosphorylated by incubation with active p38alpha before assays.
Residue:
473
  
Inhibitor
Name:
BDBM50357884
Synonyms:
CHEMBL1916359
Type:
Small organic molecule
Emp. Form.:
C20H10Cl3FN2O
Mol. Mass.:
419.664
SMILES:
[O-][n+]1ccc2c(ccnc2c1-c1c(Cl)cccc1Cl)-c1ccc(F)cc1Cl
: