Target
Suppressor of tumorigenicity 14 protein
Ligand
BDBM50358188
Substrate
Meas. Tech.
ChEMBL_789883 (CHEMBL1925190)
IC50
9800±n/a nM
Citation
 Xu, ZChen, YWBattu, AWilder, PWeber, DYu, WMackerell, ADChen, LMChai, KXJohnson, MDLin, CY Targeting zymogen activation to control the matriptase-prostasin proteolytic cascade. J Med Chem 54:7567-78 (2011)  
Target
Name:
Suppressor of tumorigenicity 14 protein
Synonyms:
Epithin MT-SP1 PRSS14 SNC19 ST14_HUMAN Suppressor of tumorigenicity 14 protein TADG15
Type:
Single-pass type II membrane protein
Mol. Mass.:
94769.23
Organism:
Homo sapiens (Human)
Description:
Q9Y5Y6
Residue:
855
  
Inhibitor
Name:
BDBM50358188
Synonyms:
CHEMBL1921966
Type:
Small organic molecule
Emp. Form.:
C16H10N2O3S3
Mol. Mass.:
374.457
SMILES:
O=C(C1C(N(C(=O)C1=O)c1nccs1)c1cccs1)c1cccs1
: