Target
Melanocortin receptor 4
Ligand
BDBM50358560
Substrate
Meas. Tech.
ChEMBL_790329 (CHEMBL1925782)
Ki
988±n/a nM
Citation
 Barkey, NMTafreshi, NKJosan, JSDe Silva, CRSill, KNHruby, VJGillies, RJMorse, DLVagner, J Development of melanoma-targeted polymer micelles by conjugation of a melanocortin 1 receptor (MC1R) specific ligand. J Med Chem 54:8078-84 (2011)  
Target
Name:
Melanocortin receptor 4
Synonyms:
MC4-R MC4R_HUMAN Melanocortin receptor 4 (MC-4) Melanocortin receptor 4 (MC4R)
Type:
Enzyme
Mol. Mass.:
36949.50
Organism:
Homo sapiens (Human)
Description:
P32245
Residue:
332
  
Inhibitor
Name:
BDBM50358560
Synonyms:
CHEMBL1923663
Type:
Small organic molecule
Emp. Form.:
C44H54N12O6
Mol. Mass.:
846.9764
SMILES:
CC(=O)N[C@@H](CCc1ccccc1)C(=O)N[C@@H](Cc1cnc[nH]1)C(=O)N[C@H](Cc1ccccc1)C(=O)N[C@@H](CCCN=C(N)N)C(=O)N[C@@H](Cc1c[nH]c2ccccc12)C(N)=O
: