Target
Melanocortin receptor 5
Ligand
BDBM50358561
Substrate
Meas. Tech.
ChEMBL_790330 (CHEMBL1925783)
Ki
46±n/a nM
Citation
 Barkey, NMTafreshi, NKJosan, JSDe Silva, CRSill, KNHruby, VJGillies, RJMorse, DLVagner, J Development of melanoma-targeted polymer micelles by conjugation of a melanocortin 1 receptor (MC1R) specific ligand. J Med Chem 54:8078-84 (2011)  
Target
Name:
Melanocortin receptor 5
Synonyms:
MC-2 MC5R Melanocortin MC5 Melanocortin receptor 5 | Melanocortin receptor 5 (MC5R)
Type:
Enzyme
Mol. Mass.:
36612.92
Organism:
Homo sapiens (Human)
Description:
P33032
Residue:
325
  
Inhibitor
Name:
BDBM50358561
Synonyms:
CHEMBL1923664
Type:
Small organic molecule
Emp. Form.:
C56H72N14O8
Mol. Mass.:
1069.2599
SMILES:
NC(N)=NCCC[C@H](NC(=O)[C@@H](Cc1ccccc1)NC(=O)[C@H](Cc1cnc[nH]1)NC(=O)CCCc1ccccc1)C(=O)N[C@@H](Cc1c[nH]c2ccccc12)C(=O)NCC(=O)N[C@@H](CCCCNC(=O)CCCC#C)C(N)=O
: