Target
Histamine H3 receptor
Ligand
BDBM50358572
Substrate
Meas. Tech.
ChEMBL_790538 (CHEMBL1925991)
Ki
1.8±n/a nM
Citation
 Becknell, NCLyons, JAAimone, LDGruner, JAMathiasen, JRRaddatz, RHudkins, RL Synthesis and evaluation of pyridone-phenoxypropyl-R-2-methylpyrrolidine analogues as histamine H3 receptor antagonists. Bioorg Med Chem Lett 21:7076-80 (2011)  
Target
Name:
Histamine H3 receptor
Synonyms:
G-protein coupled receptor 97 HH3R HRH3 Histamine H3 receptor (H3) Histamine receptor (H3 and H4)
Type:
G Protein-Coupled Receptor (GPCR)
Mol. Mass.:
48691.47
Organism:
Homo sapiens (Human)
Description:
Binding assays were using CHO cells stably expressing hH3R receptors.
Residue:
445
  
Inhibitor
Name:
BDBM50358572
Synonyms:
CHEMBL1923733
Type:
Small organic molecule
Emp. Form.:
C25H28N2O2
Mol. Mass.:
388.502
SMILES:
C[C@@H]1CCCN1CCCOc1ccc(cc1)-c1ccc(=O)n(c1)-c1ccccc1
: