Target
Arachidonate 5-lipoxygenase-activating protein
Ligand
BDBM50359084
Substrate
Meas. Tech.
ChEMBL_789491 (CHEMBL1924518)
IC50
0.600000±n/a nM
Citation
 Stock, NSBain, GZunic, JLi, YZiff, JRoppe, JSantini, ADarlington, JProdanovich, PKing, CDBaccei, CLee, CRong, HChapman, CBroadhead, ALorrain, DCorrea, LHutchinson, JHEvans, JFPrasit, P 5-Lipoxygenase-activating protein (FLAP) inhibitors. Part 4: development of 3-[3-tert-butylsulfanyl-1-[4-(6-ethoxypyridin-3-yl)benzyl]-5-(5-methylpyridin-2-ylmethoxy)-1H-indol-2-yl]-2,2-dimethylpropionic acid (AM803), a potent, oral, once daily FLAP inhibitor. J Med Chem 54:8013-29 (2011)  
Target
Name:
Arachidonate 5-lipoxygenase-activating protein
Synonyms:
5-lipoxygenase activating protein 5-lipoxygenase/FLAP ALOX5AP MK-886-binding protein
Type:
Enzyme
Mol. Mass.:
18159.90
Organism:
Homo sapiens (Human)
Description:
P20292
Residue:
161
  
Inhibitor
Name:
BDBM50359084
Synonyms:
CHEMBL1922664
Type:
Small organic molecule
Emp. Form.:
C36H38FN3O3S
Mol. Mass.:
611.769
SMILES:
Cc1ccc(COc2ccc3n(Cc4ccc(cc4)-c4cncc(F)c4)c(CC(C)(C)C(O)=O)c(SC(C)(C)C)c3c2)nc1
: