Target
Dipeptidyl peptidase 8
Ligand
BDBM50359366
Substrate
Meas. Tech.
ChEMBL_793025 (CHEMBL1932591)
IC50
68±n/a nM
Citation
 Kato, NOka, MMurase, TYoshida, MSakairi, MYamashita, SYasuda, YYoshikawa, AHayashi, YMakino, MTakeda, MMirensha, YKakigami, T Discovery and pharmacological characterization of N-[2-({2-[(2S)-2-cyanopyrrolidin-1-yl]-2-oxoethyl}amino)-2-methylpropyl]-2-methylpyrazolo[1,5-a]pyrimidine-6-carboxamide hydrochloride (anagliptin hydrochloride salt) as a potent and selective DPP-IV inhibitor. Bioorg Med Chem 19:7221-7 (2011)  
Target
Name:
Dipeptidyl peptidase 8
Synonyms:
DPP8 DPRP-1 Dipeptidyl peptidase 8 (DPP-8) Dipeptidyl peptidase 8/9 Dipeptidyl peptidase VIII Prolyl dipeptidase DPP8
Type:
Enzyme
Mol. Mass.:
103342.62
Organism:
Homo sapiens (Human)
Description:
Q6V1X1
Residue:
898
  
Inhibitor
Name:
BDBM50359366
Synonyms:
CHEMBL1929387 | CHEMBL1929396
Type:
Small organic molecule
Emp. Form.:
C19H25N7O2
Mol. Mass.:
383.4475
SMILES:
Cc1cc2ncc(cn2n1)C(=O)NCC(C)(C)NCC(=O)N1CCC[C@H]1C#N
: