Target
5-hydroxytryptamine receptor 1A
Ligand
BDBM21393
Substrate
Meas. Tech.
ChEMBL_791368 (CHEMBL1930139)
Ki
0.8±n/a nM
Citation
 Fiorino, FSeverino, BMagli, EPerissutti, EFrecentese, FEsposito, AIncisivo, GMCiano, AMassarelli, PNencini, CSantagada, VCaliendo, G New potent 5-HT(2A) receptor ligands containing an N'-cyanopicolinamidine nucleus: Synthesis and in vitro pharmacological evaluation. Eur J Med Chem 47:520-9 (2012)  
Target
Name:
5-hydroxytryptamine receptor 1A
Synonyms:
5-HT-1A 5-HT1A 5-hydroxytryptamine receptor 1A (5HT1A) 5ht1a Htr1a Serotonin 1a (5-HT1a) receptor/Adrenergic receptor alpha-1 | Serotonin receptor 1A
Type:
G Protein-Coupled Receptor (GPCR)
Mol. Mass.:
46445.29
Organism:
Rattus norvegicus (rat)
Description:
Binding assays were performed using rat hippocampal membranes.
Residue:
422
  
Inhibitor
Name:
BDBM21393
Synonyms:
7-(dipropylamino)-5,6,7,8-tetrahydronaphthalen-1-ol 8-OH-DPAT 8-OH-DPAT,(-) CHEMBL1788118 CHEMBL56 US10562853, Compound 8-OH-DPAT cid_1220
Type:
radiolabeled ligand
Emp. Form.:
C16H25NO
Mol. Mass.:
247.3758
SMILES:
CCCN(CCC)C1CCc2cccc(O)c2C1
: