Target
Cholecystokinin receptor type A
Ligand
BDBM50360273
Substrate
Meas. Tech.
ChEMBL_796412 (CHEMBL1937727)
IC50
15.7±n/a nM
Citation
 Pavan, MVLassiani, LBerti, FStefancich, GCiogli, AGasparrini, FMennuni, LFerrari, FEscrieut, CMarco, EMakovec, FFourmy, DVarnavas, A New anthranilic acid based antagonists with high affinity and selectivity for the human cholecystokinin receptor 1 (hCCK1-R). J Med Chem 54:5769-85 (2011)  
Target
Name:
Cholecystokinin receptor type A
Synonyms:
CCKAR_RAT Cholecystokinin peripheral Cholecystokinin receptor type A
Type:
Enzyme Catalytic Domain
Mol. Mass.:
49676.37
Organism:
RAT
Description:
Cholecystokinin central 0 RAT::P30551
Residue:
444
  
Inhibitor
Name:
BDBM50360273
Synonyms:
CHEMBL1933100
Type:
Small organic molecule
Emp. Form.:
C26H23N3O4
Mol. Mass.:
441.4785
SMILES:
OC(=O)C(CCc1ccccc1)NC(=O)c1ccccc1NC(=O)c1cc2ccccc2[nH]1
: