Target
Gastrin/cholecystokinin type B receptor
Ligand
BDBM50360276
Substrate
Meas. Tech.
ChEMBL_796416 (CHEMBL1937731)
Ki
1000±n/a nM
Citation
 Pavan, MVLassiani, LBerti, FStefancich, GCiogli, AGasparrini, FMennuni, LFerrari, FEscrieut, CMarco, EMakovec, FFourmy, DVarnavas, A New anthranilic acid based antagonists with high affinity and selectivity for the human cholecystokinin receptor 1 (hCCK1-R). J Med Chem 54:5769-85 (2011)  
Target
Name:
Gastrin/cholecystokinin type B receptor
Synonyms:
CCK-2 receptor CCK-BR CCKRB Cholecystokinin receptor GASR_HUMAN | Gastrin/cholecystokinin type B receptor
Type:
G Protein-Coupled Receptor (GPCR)
Mol. Mass.:
48445.79
Organism:
Homo sapiens (Human)
Description:
Stable expression of human CCK-2 receptors in HEK 293 cells.
Residue:
447
  
Inhibitor
Name:
BDBM50360276
Synonyms:
CHEMBL1933104
Type:
Small organic molecule
Emp. Form.:
C26H23N3O4
Mol. Mass.:
441.4785
SMILES:
OC(=O)[C@@H](CCc1ccccc1)NC(=O)c1ccccc1NC(=O)c1cc2ccccc2[nH]1
: