Target
ATP-dependent Clp protease proteolytic subunit
Ligand
BDBM50360279
Substrate
Meas. Tech.
ChEMBL_796596 (CHEMBL1937911)
EC50
3400±n/a nM
Citation
 Zeiler, EKorotkov, VSLorenz-Baath, KBöttcher, TSieber, SA Development and characterization of improvedß-lactone-based anti-virulence drugs targeting ClpP. Bioorg Med Chem 20:583-91 (2012)  
Target
Name:
ATP-dependent Clp protease proteolytic subunit
Synonyms:
CLPP_STAA8 clpP
Type:
PROTEIN
Mol. Mass.:
21508.79
Organism:
Staphylococcus aureus (strain NCTC 8325)
Description:
ChEMBL_796596
Residue:
195
  
Inhibitor
Name:
BDBM50360279
Synonyms:
CHEMBL1933113
Type:
Small organic molecule
Emp. Form.:
C20H28O2
Mol. Mass.:
300.4351
SMILES:
C=CCCCCCCC[C@@H]1[C@@H](CCc2ccccc2)OC1=O
: