Target
ATP-dependent Clp protease proteolytic subunit
Ligand
BDBM50360281
Substrate
Meas. Tech.
ChEMBL_796596 (CHEMBL1937911)
EC50
5400±n/a nM
Citation
 Zeiler, EKorotkov, VSLorenz-Baath, KBöttcher, TSieber, SA Development and characterization of improvedß-lactone-based anti-virulence drugs targeting ClpP. Bioorg Med Chem 20:583-91 (2012)  
Target
Name:
ATP-dependent Clp protease proteolytic subunit
Synonyms:
CLPP_STAA8 clpP
Type:
PROTEIN
Mol. Mass.:
21508.79
Organism:
Staphylococcus aureus (strain NCTC 8325)
Description:
ChEMBL_796596
Residue:
195
  
Inhibitor
Name:
BDBM50360281
Synonyms:
CHEMBL1933116
Type:
Small organic molecule
Emp. Form.:
C26H40N2O3
Mol. Mass.:
428.6074
SMILES:
CN(C)c1ccc(cc1)C(=O)NCCCCC[C@H]1OC(=O)[C@@H]1CCCCCCCC=C
: