Target
Sphingosine 1-phosphate receptor 4
Ligand
BDBM23165
Substrate
Meas. Tech.
ChEMBL_796732 (CHEMBL1938047)
IC50
2.2±n/a nM
Citation
 He, XWang, LZheng, ZXiao, JZhong, WLi, S Novel immunomodulators based on an oxazolin-2-one-4-carboxamide scaffold. Bioorg Med Chem Lett 22:553-7 (2011)  
Target
Name:
Sphingosine 1-phosphate receptor 4
Synonyms:
EDG6 S1P receptor 4 S1P4 S1PR4_HUMAN Sphingosine 1-phosphate receptor Edg-6 sphingosine-1-phosphate 4 S1P4
Type:
G Protein-Coupled Receptor (GPCR)
Mol. Mass.:
41647.39
Organism:
Homo sapiens (Human)
Description:
Residue:
384
  
Inhibitor
Name:
BDBM23165
Synonyms:
CHEMBL366208 [(2S)-2-amino-3-hydroxy-2-[2-(4-octylphenyl)ethyl]propoxy]phosphonic acid
Type:
Small organic molecule
Emp. Form.:
C19H34NO5P
Mol. Mass.:
387.4507
SMILES:
CCCCCCCCc1ccc(CC[C@](N)(CO)COP(O)(O)=O)cc1
: