Target
Sphingosine 1-phosphate receptor 1
Ligand
BDBM50360522
Substrate
Meas. Tech.
ChEMBL_796733 (CHEMBL1938048)
EC50
>100000±n/a nM
Citation
 He, XWang, LZheng, ZXiao, JZhong, WLi, S Novel immunomodulators based on an oxazolin-2-one-4-carboxamide scaffold. Bioorg Med Chem Lett 22:553-7 (2011)  
Target
Name:
Sphingosine 1-phosphate receptor 1
Synonyms:
CHEDG1 Endothelial differentiation G-protein coupled receptor 1 S1P1 S1PR1_HUMAN Sphingosine 1-phosphate receptor Edg-1
Type:
Enzyme
Mol. Mass.:
42836.02
Organism:
Homo sapiens (Human)
Description:
P21453
Residue:
382
  
Inhibitor
Name:
BDBM50360522
Synonyms:
CHEMBL1935662
Type:
Small organic molecule
Emp. Form.:
C19H19ClN2O4
Mol. Mass.:
374.818
SMILES:
NC(=O)C1(CCc2ccc(OCc3ccccc3Cl)cc2)COC(=O)N1
: