Target
Sphingosine 1-phosphate receptor 1
Ligand
BDBM50158336
Substrate
Meas. Tech.
ChEMBL_796733 (CHEMBL1938048)
EC50
3000±n/a nM
Citation
 He, XWang, LZheng, ZXiao, JZhong, WLi, S Novel immunomodulators based on an oxazolin-2-one-4-carboxamide scaffold. Bioorg Med Chem Lett 22:553-7 (2011)  
Target
Name:
Sphingosine 1-phosphate receptor 1
Synonyms:
CHEDG1 Endothelial differentiation G-protein coupled receptor 1 S1P1 S1PR1_HUMAN Sphingosine 1-phosphate receptor Edg-1
Type:
Enzyme
Mol. Mass.:
42836.02
Organism:
Homo sapiens (Human)
Description:
P21453
Residue:
382
  
Inhibitor
Name:
BDBM50158336
Synonyms:
2-(4-octylphenethyl)-2-aminopropane-1,3-diol 2-amino-2-(4-octylphenethyl)propane-1,3-diol CHEMBL314854 FINGOLIMOD HYDROCHLORIDE
Type:
Small organic molecule
Emp. Form.:
C19H33NO2
Mol. Mass.:
307.4708
SMILES:
CCCCCCCCc1ccc(CCC(N)(CO)CO)cc1
: