Target
MAP kinase-activated protein kinase 2
Ligand
BDBM50360550
Substrate
Meas. Tech.
ChEMBL_795360 (CHEMBL1937260)
EC50
1.6±n/a nM
Citation
 Oubrie, AKaptein, Ade Zwart, EHoogenboom, NGoorden, Rvan de Kar, Bvan Hoek, Mde Kimpe, Vvan der Heijden, RBorsboom, JKazemier, Bde Roos, JScheffers, MLommerse, JSchultz-Fademrecht, CBarf, T Novel ATP competitive MK2 inhibitors with potent biochemical and cell-based activity throughout the series. Bioorg Med Chem Lett 22:613-8 (2011)  
Target
Name:
MAP kinase-activated protein kinase 2
Synonyms:
MAP kinase-activated protein kinase 2 (MAPKAPK2) MAP kinase-activated protein kinase 2 (p38/MK2) MAPK-activated protein kinase 2 MAPKAP kinase 2 MAPKAPK2 | MK2
Type:
Serine/threonine-protein kinase
Mol. Mass.:
45579.87
Organism:
Homo sapiens (Human)
Description:
P49137
Residue:
400
  
Inhibitor
Name:
BDBM50360550
Synonyms:
CHEMBL1933192
Type:
Small organic molecule
Emp. Form.:
C23H20F3N5O3
Mol. Mass.:
471.4318
SMILES:
FC(F)(F)Oc1cccc(c1)C(=O)Nc1cc(ccn1)-c1cc2c([nH]1)C1(CCNC1)CNC2=O
: