Target
MAP kinase-activated protein kinase 2
Ligand
BDBM50360568
Substrate
Meas. Tech.
ChEMBL_795360 (CHEMBL1937260)
EC50
2.7±n/a nM
Citation
 Oubrie, AKaptein, Ade Zwart, EHoogenboom, NGoorden, Rvan de Kar, Bvan Hoek, Mde Kimpe, Vvan der Heijden, RBorsboom, JKazemier, Bde Roos, JScheffers, MLommerse, JSchultz-Fademrecht, CBarf, T Novel ATP competitive MK2 inhibitors with potent biochemical and cell-based activity throughout the series. Bioorg Med Chem Lett 22:613-8 (2011)  
Target
Name:
MAP kinase-activated protein kinase 2
Synonyms:
MAP kinase-activated protein kinase 2 (MAPKAPK2) MAP kinase-activated protein kinase 2 (p38/MK2) MAPK-activated protein kinase 2 MAPKAP kinase 2 MAPKAPK2 | MK2
Type:
Serine/threonine-protein kinase
Mol. Mass.:
45579.87
Organism:
Homo sapiens (Human)
Description:
P49137
Residue:
400
  
Inhibitor
Name:
BDBM50360568
Synonyms:
CHEMBL1933174
Type:
Small organic molecule
Emp. Form.:
C25H24F3N5O3
Mol. Mass.:
499.485
SMILES:
CN1CCC2(CC1)CNC(=O)c1cc([nH]c21)-c1ccnc(NC(=O)c2cccc(OC(F)(F)F)c2)c1
: