Target
Adenosine receptor A3
Ligand
BDBM50361318
Substrate
Meas. Tech.
ChEMBL_794927 (CHEMBL1936206)
Ki
124±n/a nM
Citation
 Baraldi, PGSaponaro, GAghazadeh Tabrizi, MBaraldi, SRomagnoli, RMoorman, ARVarani, KBorea, PAPreti, D Pyrrolo- and pyrazolo-[3,4-e][1,2,4]triazolo[1,5-c]pyrimidines as adenosine receptor antagonists. Bioorg Med Chem 20:1046-59 (2012)  
Target
Name:
Adenosine receptor A3
Synonyms:
A3 adenosine receptor (hA3) ADORA3 | Adenosine A3 receptor (A3AR)
Type:
G Protein-Coupled Receptor (GPCR)
Mol. Mass.:
36197.32
Organism:
Homo sapiens (Human)
Description:
P0DMS8
Residue:
318
  
Inhibitor
Name:
BDBM50361318
Synonyms:
CHEMBL1935745
Type:
Small organic molecule
Emp. Form.:
C19H16N6O
Mol. Mass.:
344.3699
SMILES:
Nc1nc2cn(CCc3ccccc3)cc2c2nc(nn12)-c1ccco1
: