Target
Adenosine receptor A2a
Ligand
BDBM50361326
Substrate
Meas. Tech.
ChEMBL_794899 (CHEMBL1936135)
Ki
12±n/a nM
Citation
 Baraldi, PGSaponaro, GAghazadeh Tabrizi, MBaraldi, SRomagnoli, RMoorman, ARVarani, KBorea, PAPreti, D Pyrrolo- and pyrazolo-[3,4-e][1,2,4]triazolo[1,5-c]pyrimidines as adenosine receptor antagonists. Bioorg Med Chem 20:1046-59 (2012)  
Target
Name:
Adenosine receptor A2a
Synonyms:
A2A adenosine receptor (hA2A) ADENOSINE A2 ADORA2 Adenosine A2A receptor (A2AAR)
Type:
G Protein-Coupled Receptor (GPCR)
Mol. Mass.:
44716.46
Organism:
Homo sapiens (Human)
Description:
P29274
Residue:
412
  
Inhibitor
Name:
BDBM50361326
Synonyms:
CHEMBL1935753
Type:
Small organic molecule
Emp. Form.:
C13H13N7O
Mol. Mass.:
283.2886
SMILES:
CCCn1ncc2nc(N)n3nc(nc3c12)-c1ccco1
: