Target
Adenosine receptor A2a
Ligand
BDBM50361329
Substrate
Meas. Tech.
ChEMBL_794899 (CHEMBL1936135)
Ki
68±n/a nM
Citation
 Baraldi, PGSaponaro, GAghazadeh Tabrizi, MBaraldi, SRomagnoli, RMoorman, ARVarani, KBorea, PAPreti, D Pyrrolo- and pyrazolo-[3,4-e][1,2,4]triazolo[1,5-c]pyrimidines as adenosine receptor antagonists. Bioorg Med Chem 20:1046-59 (2012)  
Target
Name:
Adenosine receptor A2a
Synonyms:
A2A adenosine receptor (hA2A) ADENOSINE A2 ADORA2 Adenosine A2A receptor (A2AAR)
Type:
G Protein-Coupled Receptor (GPCR)
Mol. Mass.:
44716.46
Organism:
Homo sapiens (Human)
Description:
P29274
Residue:
412
  
Inhibitor
Name:
BDBM50361329
Synonyms:
CHEMBL1935756
Type:
Small organic molecule
Emp. Form.:
C19H16N8O3
Mol. Mass.:
404.3821
SMILES:
COc1ccc(NC(=O)Nc2nc3cnn(C)c3c3nc(nn23)-c2ccco2)cc1
: