Target
Amine oxidase [flavin-containing] B
Ligand
BDBM50346585
Substrate
Meas. Tech.
ChEMBL_797216 (CHEMBL1942531)
Ki
17000±n/a nM
Citation
 Suzuki, TMiyata, N Lysine demethylases inhibitors. J Med Chem 54:8236-50 (2011)  
Target
Name:
Amine oxidase [flavin-containing] B
Synonyms:
AOFB_HUMAN MAOB Monoamine oxidase type B (MAO B) Monoamine oxidase type B (MAOB)
Type:
Protein
Mol. Mass.:
58768.76
Organism:
Homo sapiens (Human)
Description:
P27338
Residue:
520
  
Inhibitor
Name:
BDBM50346585
Synonyms:
CHEMBL1795980 | S2101
Type:
Small organic molecule
Emp. Form.:
C16H15F2NO
Mol. Mass.:
275.2932
SMILES:
NC1CC1c1cc(F)cc(F)c1OCc1ccccc1
: