Target
Amine oxidase [flavin-containing] B
Ligand
BDBM50361481
Substrate
Meas. Tech.
ChEMBL_797216 (CHEMBL1942531)
Ki
>40000±n/a nM
Citation
 Suzuki, TMiyata, N Lysine demethylases inhibitors. J Med Chem 54:8236-50 (2011)  
Target
Name:
Amine oxidase [flavin-containing] B
Synonyms:
AOFB_HUMAN MAOB Monoamine oxidase type B (MAO B) Monoamine oxidase type B (MAOB)
Type:
Protein
Mol. Mass.:
58768.76
Organism:
Homo sapiens (Human)
Description:
P27338
Residue:
520
  
Inhibitor
Name:
BDBM50361481
Synonyms:
CHEMBL1938898
Type:
Small organic molecule
Emp. Form.:
C23H25F4N3O
Mol. Mass.:
435.4577
SMILES:
CN1CCN(CC1)C(=O)CNC1CC1c1ccc(cc1)-c1cc(F)ccc1C(F)(F)F
: