Target
Glutathione S-transferase Mu 1
Ligand
BDBM50361795
Substrate
Meas. Tech.
ChEMBL_799591 (CHEMBL1941297)
IC50
123500±n/a nM
Citation
 Wang, CHWu, HTCheng, HMYen, TJLu, IHChang, HCJao, SCShing, TKLi, WS Inhibition of glutathione S-transferase M1 by new gabosine analogues is essential for overcoming cisplatin resistance in lung cancer cells. J Med Chem 54:8574-81 (2011)  
Target
Name:
Glutathione S-transferase Mu 1
Synonyms:
GST class-mu 1 GSTM1 GSTM1_HUMAN GSTM1b-1b Glutathione S-transferase Mu 1 glutathione S-transferase
Type:
PROTEIN
Mol. Mass.:
25712.03
Organism:
Homo sapiens (Human)
Description:
ChEMBL_799596
Residue:
218
  
Inhibitor
Name:
BDBM50361795
Synonyms:
CHEMBL1938636
Type:
Small organic molecule
Emp. Form.:
C21H34O8
Mol. Mass.:
414.4899
SMILES:
CCCCCCO[C@H]1C=C(COC(C)=O)C(=O)[C@@H]2O[C@@](C)(OC)[C@](C)(OC)O[C@@H]12
: