Target
Tyrosine-protein kinase JAK1
Ligand
BDBM50193995
Substrate
Meas. Tech.
ChEMBL_799678 (CHEMBL1941384)
IC50
3±n/a nM
Citation
 Schenkel, LBHuang, XCheng, ADeak, HLDoherty, EEmkey, RGu, YGunaydin, HKim, JLLee, JLoberg, ROlivieri, PPistillo, JTang, JWan, QWang, HLWang, SWWells, MCWu, BYu, VLiu, LGeuns-Meyer, S Discovery of potent and highly selective thienopyridine Janus kinase 2 inhibitors. J Med Chem 54:8440-50 (2011)  
Target
Name:
Tyrosine-protein kinase JAK1
Synonyms:
JAK-1 JAK1A JAK1_HUMAN Janus kinase 1 (JAK1) | Janus kinase 1 JAK1
Type:
Protein
Mol. Mass.:
133293.73
Organism:
Homo sapiens (Human)
Description:
P23458
Residue:
1154
  
Inhibitor
Name:
BDBM50193995
Synonyms:
3-((3R,4R)-4-methyl-3-(methyl(7H-pyrrolo[2,3-d]pyrimidin-4-yl)amino)piperidin-1-yl)-3-oxopropanenitrile 3-{(3R,4R)-4-methyl-3-[methyl(7H-pyrrolo[2,3-d]pyrimidin-4-yl)amino]piperidin-1-yl}-3-oxopropanenitrile CP-690550 Tofacitinib US10112907, Example 00035 US10766894, Compound TABLE 1.20 US11078206, Example Tofacitinib US11339167, Example Tofacitinib
Type:
Small organic molecule
Emp. Form.:
C16H20N6O
Mol. Mass.:
312.3696
SMILES:
C[C@@H]1CCN(C[C@@H]1N(C)c1ncnc2[nH]ccc12)C(=O)CC#N
: