Target
Sphingosine 1-phosphate receptor 3
Ligand
BDBM23165
Substrate
Meas. Tech.
ChEMBL_799914 (CHEMBL1941620)
EC50
27±n/a nM
Citation
 Pennington, LDCroghan, MDSham, KKPickrell, AJHarrington, PEFrohn, MJLanman, BAReed, ABLee, MRXu, HMcElvain, MXu, YZhang, XFiorino, MHorner, MMorrison, HGArnett, HAFotsch, CTasker, ASWong, MCee, VJ Quinolinone-based agonists of S1P¿?: use of a N-scan SAR strategy to optimize in vitro and in vivo activity. Bioorg Med Chem Lett 22:527-31 (2011)  
Target
Name:
Sphingosine 1-phosphate receptor 3
Synonyms:
C9orf108 EDG3 S1P receptor 3 S1P3 S1PR3_HUMAN Sphingosine 1-phosphate receptor 3 (S1P3) | Sphingosine 1-phosphate receptor Edg-3
Type:
G Protein-Coupled Receptor (GPCR)
Mol. Mass.:
42278.13
Organism:
Homo sapiens (Human)
Description:
Q99500
Residue:
378
  
Inhibitor
Name:
BDBM23165
Synonyms:
CHEMBL366208 [(2S)-2-amino-3-hydroxy-2-[2-(4-octylphenyl)ethyl]propoxy]phosphonic acid
Type:
Small organic molecule
Emp. Form.:
C19H34NO5P
Mol. Mass.:
387.4507
SMILES:
CCCCCCCCc1ccc(CC[C@](N)(CO)COP(O)(O)=O)cc1
: