Target
Sphingosine 1-phosphate receptor 3
Ligand
BDBM50361893
Substrate
Meas. Tech.
ChEMBL_799914 (CHEMBL1941620)
EC50
2500±n/a nM
Citation
 Pennington, LDCroghan, MDSham, KKPickrell, AJHarrington, PEFrohn, MJLanman, BAReed, ABLee, MRXu, HMcElvain, MXu, YZhang, XFiorino, MHorner, MMorrison, HGArnett, HAFotsch, CTasker, ASWong, MCee, VJ Quinolinone-based agonists of S1P¿?: use of a N-scan SAR strategy to optimize in vitro and in vivo activity. Bioorg Med Chem Lett 22:527-31 (2011)  
Target
Name:
Sphingosine 1-phosphate receptor 3
Synonyms:
C9orf108 EDG3 S1P receptor 3 S1P3 S1PR3_HUMAN Sphingosine 1-phosphate receptor 3 (S1P3) | Sphingosine 1-phosphate receptor Edg-3
Type:
G Protein-Coupled Receptor (GPCR)
Mol. Mass.:
42278.13
Organism:
Homo sapiens (Human)
Description:
Q99500
Residue:
378
  
Inhibitor
Name:
BDBM50361893
Synonyms:
CHEMBL1938939
Type:
Small organic molecule
Emp. Form.:
C23H16F3N3O2
Mol. Mass.:
423.3872
SMILES:
Cn1cc(C(=O)Nc2ccc(-c3ccccc3)c(c2)C(F)(F)F)c(=O)c2ncccc12
: