Target
B1 bradykinin receptor
Ligand
BDBM50362366
Substrate
Meas. Tech.
ChEMBL_797691 (CHEMBL1943911)
Ki
0.045±n/a nM
Citation
 Qian, WChen, JJHuman, JAya, TZhu, JBiswas, KPeterkin, THungate, RWArik, LJohnson, EKumar, GJoseph, SJona, JGuo, HXWu, Z Discovery of dehydro-oxopiperazine acetamides as novel bradykinin B1 receptor antagonists with enhanced in vitro potency. Bioorg Med Chem Lett 22:1061-7 (2012)  
Target
Name:
B1 bradykinin receptor
Synonyms:
B1 BRADYKININ B1R BK-1 receptor BRADYB1 | Bradykinin B1 receptor
Type:
Enzyme
Mol. Mass.:
40508.87
Organism:
Homo sapiens (Human)
Description:
P46663
Residue:
353
  
Inhibitor
Name:
BDBM50362366
Synonyms:
CHEMBL1939755
Type:
Small organic molecule
Emp. Form.:
C29H36N4O4S
Mol. Mass.:
536.686
SMILES:
Cc1ccc(cc1)S(=O)(=O)N1C=CNC(=O)[C@H]1CC(=O)N[C@@H]1CCCc2cc(CN3CCCCC3)ccc12
: